Monthly Archives: February 2016

  1. Error: EACCES, permission denied Ionic Cordova IOS

    The error you have received is from NPM (since the Cordova CLI is installed via NPM). This is a tricky issue where using NPM with sudo, and then not using sudo will result in weird permission issues.

     

    Read more »
  2. Execution failed app:processDebugResources Android Studio

    FAILURE: Build failed with an exception.

    * What went wrong:
    Execution failed for task ':CordovaLib:processDebugResources'.
    > com.android.ide.common.process.ProcessException: org.gradle.process.internal.ExecException: Process 'co

    Read more »
  3. Failed to find 'ANDROID_HOME' environment variable

    i have this error when i am trying to build

    [Error: Failed to find 'ANDROID_HOME' environment variable. Try setting setting it manually.
    Failed to find 'android' command in your 'PATH'. Try update your 'PATH' to include path to valid SDK d

    Read more »
  4. Laravel 5.1 PHP DOMXPath() class not found

    I'm using PHP's built-in DOMXPath() class to do some simple web-scrapping. However, it works on my 4.2 site, but not my 5.1 (both are on same installation of PHP).

    Here's the error:

    Read more »

  5. Laravel 5.1 PHP DOMDocument() class not found

    I'm using PHP's built-in DOMDocument() class to do some simple web-scrapping. However, it works on my 4.2 site, but not my 5.1 (both are on same installation of PHP).

    Here's the error:

    Read more »

Copyright © 2016 Samdoit Infotech. All rights reserved.